Target
ATP-sensitive inward rectifier potassium channel 1
Ligand
BDBM50121355
Substrate
Meas. Tech.
ChEMBL_1522251 (CHEMBL3626480)
IC50
10±n/a nM
Citation
 Blass, B Inhibitors of the Renal Outer Medullary Potassium Channel. ACS Med Chem Lett 6:831-3 (2015)  
Target
Name:
ATP-sensitive inward rectifier potassium channel 1
Synonyms:
ATP-regulated potassium channel ROM-K ATP-sensitive inward rectifier potassium channel 1 KCNJ1 Potassium channel (ATP modulatory) ROMK1 The Renal Outer Medullary Potassium (ROMK)
Type:
Enzyme Catalytic Domain
Mol. Mass.:
44809.08
Organism:
Homo sapiens (Human)
Description:
gi_223460826
Residue:
391
  
Inhibitor
Name:
BDBM50121355
Synonyms:
CHEMBL3622112 | US9751881, Example 81
Type:
Small organic molecule
Emp. Form.:
C26H30N4O3
Mol. Mass.:
446.5414
SMILES:
Cc1cc(cnc1C#N)N1CCC2(C1)CCN(C[C@H](O)c1ccc3C(=O)OCc3c1C)CC2
: