Target
B2 bradykinin receptor
Ligand
BDBM50121679
Substrate
Meas. Tech.
ChEMBL_1516518 (CHEMBL3619869)
Ki
>10000±n/a nM
Citation
 Deekonda, SRankin, DDavis, PLai, JPorreca, FHruby, VJ Design, synthesis and biological evaluation of multifunctional ligands targeting opioid and bradykinin 2 receptors. Bioorg Med Chem Lett 25:4148-52 (2015)  
Target
Name:
B2 bradykinin receptor
Synonyms:
B2 BRADYKININ B2R BKRB2_RAT Bradykinin B2 receptor
Type:
Enzyme Catalytic Domain
Mol. Mass.:
44941.22
Organism:
RAT
Description:
B2 BRADYKININ BDKRB2 RAT::P25023
Residue:
396
  
Inhibitor
Name:
BDBM50121679
Synonyms:
CHEMBL3616878
Type:
Small organic molecule
Emp. Form.:
C82H114N22O17S
Mol. Mass.:
1711.985
SMILES:
N[C@@H](Cc1ccc(O)cc1)C(=O)N1CCC[C@H]1C(=O)N[C@@H](Cc1ccccc1)C(=O)N[C@H](CCCNC(N)=N)C(=O)N[C@@H](CCCNC(N)=N)C(=O)N1CCC[C@H]1C(=O)N1CC(O)CC1C(=O)NCC(=O)NC(Cc1cccs1)C(=O)N[C@@H](CO)C(=O)N1Cc2ccccc2C[C@@H]1C(=O)N1C2CCCCC2CC1C(=O)N[C@@H](CCCNC(N)=N)C(O)=O
: