Target
Tyrosine-protein kinase Lyn
Ligand
BDBM50121690
Substrate
Meas. Tech.
ChEMBL_1516624 (CHEMBL3620299)
IC50
66±n/a nM
Citation
 Im, DJung, KYang, SAman, WHah, JM Discovery of 4-arylamido 3-methyl isoxazole derivatives as novel FMS kinase inhibitors. Eur J Med Chem 102:600-10 (2015)  
Target
Name:
Tyrosine-protein kinase Lyn
Synonyms:
JTK8 LYN_HUMAN Tyrosine-protein kinase Lyn (LYN) p53Lyn | p56Lyn
Type:
Protein
Mol. Mass.:
58575.92
Organism:
Homo sapiens (Human)
Description:
P07948
Residue:
512
  
Inhibitor
Name:
BDBM50121690
Synonyms:
CHEMBL3616960
Type:
Small organic molecule
Emp. Form.:
C25H26F3N5O3
Mol. Mass.:
501.5008
SMILES:
CN1CCN(CC1)c1cc(cc(c1)C(F)(F)F)C(=O)Nc1ccc(C)c(NC(=O)c2cnoc2C)c1
: