Target
Nuclear receptor ROR-alpha
Ligand
BDBM50044160
Substrate
Meas. Tech.
ChEMBL_1517042 (CHEMBL3619501)
EC50
29±n/a nM
Citation
 Fauber, BPGobbi, ASavy, PBurton, BDeng, YEverett, CLa, HJohnson, ARLockey, PNorman, MWong, H Identification of N-sulfonyl-tetrahydroquinolines as RORc inverse agonists. Bioorg Med Chem Lett 25:4109-13 (2015)  
Target
Name:
Nuclear receptor ROR-alpha
Synonyms:
NR1F1 Nuclear receptor subfamily 1 group F member 1 RORA RZRA | Retinoid-related orphan receptor-alpha
Type:
PROTEIN
Mol. Mass.:
58976.26
Organism:
Homo sapiens (Human)
Description:
ChEMBL_101591
Residue:
523
  
Inhibitor
Name:
BDBM50044160
Synonyms:
CHEMBL3314003
Type:
Small organic molecule
Emp. Form.:
C22H17ClF2N2O3S
Mol. Mass.:
462.897
SMILES:
Fc1ccc(cc1)S(=O)(=O)N1CCCc2ccc(NC(=O)c3c(F)cccc3Cl)cc12
: