Target
D-aspartate oxidase
Ligand
BDBM50121995
Substrate
Meas. Tech.
ChEMBL_1517179 (CHEMBL3620069)
IC50
87100±n/a nM
Citation
 Katane, MYamada, SKawaguchi, GChinen, MMatsumura, MAndo, TDoi, INakayama, KKaneko, YMatsuda, SSaitoh, YMiyamoto, TSekine, MYamaotsu, NHirono, SHomma, H Identification of Novel D-Aspartate Oxidase Inhibitors by in Silico Screening and Their Functional and Structural Characterization in Vitro. J Med Chem 58:7328-40 (2015)  
Target
Name:
D-aspartate oxidase
Synonyms:
D-Aspartate Oxidase (DDO) DDO | OXDD_HUMAN
Type:
Oxidoreductase
Mol. Mass.:
37543.06
Organism:
Homo sapiens (Human)
Description:
Recombinant human DDO expressed and purified from sf9 insect cells, was used in enzyme assays.
Residue:
341
  
Inhibitor
Name:
BDBM50121995
Synonyms:
CHEMBL3617316
Type:
Small organic molecule
Emp. Form.:
C6H4N4O3
Mol. Mass.:
180.121
SMILES:
OC(=O)c1cn2cnnc2nc1O
: