Target
Tyrosine-protein kinase JAK2
Ligand
BDBM50122325
Substrate
Meas. Tech.
ChEMBL_1518838 (CHEMBL3625512)
IC50
3.1±n/a nM
Citation
 Wan, HSchroeder, GMHart, ACInghrim, JGrebinski, JTokarski, JSLorenzi, MVYou, DMcdevitt, TPenhallow, BVuppugalla, RZhang, YGu, XIyer, RLombardo, LJTrainor, GLRuepp, SLippy, JBlat, YSack, JSKhan, JAStefanski, KSleczka, BMathur, ASun, JHWong, MKWu, DRLi, PGupta, AArunachalam, PNPragalathan, BNarayanan, SK C, NKuppusamy, PPurandare, AV Discovery of a Highly Selective JAK2 Inhibitor, BMS-911543, for the Treatment of Myeloproliferative Neoplasms. ACS Med Chem Lett 6:850-5 (2015)  
Target
Name:
Tyrosine-protein kinase JAK2
Synonyms:
JAK-2 JAK2_HUMAN Janus kinase 2 (JAK2) | Janus kinase 2 (a protein tyrosine kinase)
Type:
Protein
Mol. Mass.:
130684.68
Organism:
Homo sapiens (Human)
Description:
O60674
Residue:
1132
  
Inhibitor
Name:
BDBM50122325
Synonyms:
CHEMBL3622144
Type:
Small organic molecule
Emp. Form.:
C24H28N8O2S
Mol. Mass.:
492.597
SMILES:
CCn1c(cc2c1nc(Nc1nc(C(=O)NC)c(C)s1)c1ncn(C)c21)C(=O)N(C1CC1)C1CC1
: