Target
Tyrosine-protein kinase SYK
Ligand
BDBM50123586
Substrate
Meas. Tech.
ChEMBL_1521568 (CHEMBL3627446)
IC50
186±n/a nM
Citation
 Thoma, GVeenstra, SStrang, RBlanz, JVangrevelinghe, EBerghausen, JLee, CCZerwes, HG Orally bioavailable Syk inhibitors with activity in a rat PK/PD model. Bioorg Med Chem Lett 25:4642-7 (2015)  
Target
Name:
Tyrosine-protein kinase SYK
Synonyms:
KSYK_HUMAN Spleen Tyrosine Kinase Tyrosine-protein kinase SYK (Syk)
Type:
Enzyme
Mol. Mass.:
72079.99
Organism:
Homo sapiens (Human)
Description:
P43405
Residue:
635
  
Inhibitor
Name:
BDBM50123586
Synonyms:
CHEMBL3622204
Type:
Small organic molecule
Emp. Form.:
C17H18N4O2S
Mol. Mass.:
342.415
SMILES:
[H][C@@]1(CNC(=O)C1)[C@@H](C)Oc1cc(cc2ncsc12)-c1cnn(C)c1
: