Target
Potassium voltage-gated channel subfamily H member 2
Ligand
BDBM50123568
Substrate
Meas. Tech.
ChEMBL_1521783 (CHEMBL3626606)
IC50
>30000±n/a nM
Citation
 Thoma, GVeenstra, SStrang, RBlanz, JVangrevelinghe, EBerghausen, JLee, CCZerwes, HG Orally bioavailable Syk inhibitors with activity in a rat PK/PD model. Bioorg Med Chem Lett 25:4642-7 (2015)  
Target
Name:
Potassium voltage-gated channel subfamily H member 2
Synonyms:
1,3-beta-glucan synthase component GLS2 ERG Eag-related protein 1 Ether-a-go-go-related gene (HERG) Ether-a-go-go-related gene potassium channel 1 Ether-a-go-go-related gene potassium channel 1 (hERG1) Ether-a-go-go-related protein 1 H-ERG KCNH2 Potassium voltage-gated channel subfamily H member 2 (hERG) Voltage-gated potassium channel subunit Kv11.1 hERG Potassium Channel 1 | putative potassium channel subunit
Type:
Multi-pass membrane protein
Mol. Mass.:
126672.65
Organism:
Homo sapiens (Human)
Description:
Q12809
Residue:
1159
  
Inhibitor
Name:
BDBM50123568
Synonyms:
CHEMBL3622203
Type:
Small organic molecule
Emp. Form.:
C15H13F2N5O3S
Mol. Mass.:
381.357
SMILES:
[H][C@@]1(CNC(=O)O1)[C@@H](C)Oc1nc(cc2ncsc12)-c1cnn(c1)C(F)F
: