Target
Kappa-type opioid receptor
Ligand
BDBM50123598
Substrate
Meas. Tech.
ChEMBL_1521810 (CHEMBL3626670)
Ki
4.7±n/a nM
Citation
 Lee, DYDeng, GMa, ZXu, WYang, LLiu, JDai, RLiu-Chen, LY Synthesis and biological evaluation of 2-alkyl-2-methoxymethyl-salvinorin ethers as selectiveż-opioid receptor agonists. Bioorg Med Chem Lett 25:4689-92 (2015)  
Target
Name:
Kappa-type opioid receptor
Synonyms:
K-OR-1 Kappa-opioid receptor (KOR) Kappa-type opioid receptor (KOR) OPIATE Kappa OPRK1 kappa opioid receptor (KOR)
Type:
G Protein-Coupled Receptor (GPCR)
Mol. Mass.:
42648.76
Organism:
Homo sapiens (Human)
Description:
P41145
Residue:
380
  
Inhibitor
Name:
BDBM50123598
Synonyms:
CHEMBL3622713
Type:
Small organic molecule
Emp. Form.:
C24H32O7
Mol. Mass.:
432.5067
SMILES:
[H][C@@]12CC[C@@]3(C)[C@@H](C[C@](C)(COC)C(=O)[C@]3([H])[C@@]1(C)C[C@H](OC2=O)c1ccoc1)C(=O)OC
: