Target
Polyunsaturated fatty acid lipoxygenase ALOX15
Ligand
BDBM50123673
Substrate
Meas. Tech.
ChEMBL_1522060 (CHEMBL3627220)
Ki
100±n/a nM
Citation
 Eleftheriadis, NNeochoritis, CGLeus, NGvan der Wouden, PEDömling, ADekker, FJ Rational Development of a Potent 15-Lipoxygenase-1 Inhibitor with in Vitro and ex Vivo Anti-inflammatory Properties. J Med Chem 58:7850-62 (2015)  
Target
Name:
Polyunsaturated fatty acid lipoxygenase ALOX15
Synonyms:
15-Lipoxygenase-1 (15-LOX-1) Arachidonate 15-lipoxygenase LOG15 Reticulocyte 15-lipoxygenase-1 | Sphingosine 1-phosphate receptor 1 (S1P1)
Type:
Protein
Mol. Mass.:
74804.05
Organism:
Homo sapiens (Human)
Description:
Residue:
662
  
Inhibitor
Name:
BDBM50123673
Synonyms:
CHEMBL3622739
Type:
Small organic molecule
Emp. Form.:
C19H24ClNO3
Mol. Mass.:
349.852
SMILES:
CCCCCCCC(=O)c1c([nH]c2cc(Cl)ccc12)C(=O)OCC
: