Target
Calcium/calmodulin-dependent protein kinase type IV
Ligand
BDBM50123803
Substrate
Meas. Tech.
ChEMBL_1518905 (CHEMBL3625829)
IC50
>10000±n/a nM
Citation
 Lin, XDYang, HWMa, SLi, WWZhang, CHWang, WJXiang, RLi, LLYang, SY Discovery of 6-phenylimidazo[2,1-b]thiazole derivatives as a new type of FLT3 inhibitors. Bioorg Med Chem Lett 25:4534-8 (2015)  
Target
Name:
Calcium/calmodulin-dependent protein kinase type IV
Synonyms:
CAM kinase-GR CAMK-GR CAMKIV CaMK IV KCC4_HUMAN
Type:
PROTEIN
Mol. Mass.:
51919.87
Organism:
Homo sapiens (Human)
Description:
ChEMBL_1459854
Residue:
473
  
Inhibitor
Name:
BDBM50123803
Synonyms:
CHEMBL3623375
Type:
Small organic molecule
Emp. Form.:
C25H31N7O3S
Mol. Mass.:
509.624
SMILES:
CN(C)CCCNC(=O)c1csc2nc(cn12)-c1ccc(NC(=O)Nc2cc(on2)C(C)(C)C)cc1
: