Target
Aurora kinase B
Ligand
BDBM50123803
Substrate
Meas. Tech.
ChEMBL_1518901 (CHEMBL3625825)
IC50
>10000±n/a nM
Citation
 Lin, XDYang, HWMa, SLi, WWZhang, CHWang, WJXiang, RLi, LLYang, SY Discovery of 6-phenylimidazo[2,1-b]thiazole derivatives as a new type of FLT3 inhibitors. Bioorg Med Chem Lett 25:4534-8 (2015)  
Target
Name:
Aurora kinase B
Synonyms:
AIK2 AIM1 ARK2 AURKB_HUMAN Aurora B-INCENP Aurora kinase B (AURKB) STK-1 STK12 Serine/threonine-protein kinase aurora B
Type:
Protein
Mol. Mass.:
39327.72
Organism:
Homo sapiens (Human)
Description:
Q96GD4
Residue:
344
  
Inhibitor
Name:
BDBM50123803
Synonyms:
CHEMBL3623375
Type:
Small organic molecule
Emp. Form.:
C25H31N7O3S
Mol. Mass.:
509.624
SMILES:
CN(C)CCCNC(=O)c1csc2nc(cn12)-c1ccc(NC(=O)Nc2cc(on2)C(C)(C)C)cc1
: