Target
Fibroblast growth factor receptor 2
Ligand
BDBM50123803
Substrate
Meas. Tech.
ChEMBL_1518916 (CHEMBL3625840)
IC50
>10000±n/a nM
Citation
 Lin, XDYang, HWMa, SLi, WWZhang, CHWang, WJXiang, RLi, LLYang, SY Discovery of 6-phenylimidazo[2,1-b]thiazole derivatives as a new type of FLT3 inhibitors. Bioorg Med Chem Lett 25:4534-8 (2015)  
Target
Name:
Fibroblast growth factor receptor 2
Synonyms:
BEK FGFR-2 FGFR2 Fibroblast growth factor receptor 2 (FGFR2) KGFR Keratinocyte growth factor receptor VEGF-receptor 2 and Fibroblast growth factor receptor 2
Type:
Enzyme
Mol. Mass.:
92015.45
Organism:
Homo sapiens (Human)
Description:
P21802
Residue:
821
  
Inhibitor
Name:
BDBM50123803
Synonyms:
CHEMBL3623375
Type:
Small organic molecule
Emp. Form.:
C25H31N7O3S
Mol. Mass.:
509.624
SMILES:
CN(C)CCCNC(=O)c1csc2nc(cn12)-c1ccc(NC(=O)Nc2cc(on2)C(C)(C)C)cc1
: