Target
Mitogen-activated protein kinase kinase kinase 9
Ligand
BDBM50123803
Substrate
Meas. Tech.
ChEMBL_1519166 (CHEMBL3624359)
IC50
>10000±n/a nM
Citation
 Lin, XDYang, HWMa, SLi, WWZhang, CHWang, WJXiang, RLi, LLYang, SY Discovery of 6-phenylimidazo[2,1-b]thiazole derivatives as a new type of FLT3 inhibitors. Bioorg Med Chem Lett 25:4534-8 (2015)  
Target
Name:
Mitogen-activated protein kinase kinase kinase 9
Synonyms:
M3K9_HUMAN MLK1 Mitogen-activated protein kinase kinase kinase 9 (MLK1) PRKE1
Type:
protein
Mol. Mass.:
121881.51
Organism:
Homo sapiens (Human)
Description:
P80192
Residue:
1104
  
Inhibitor
Name:
BDBM50123803
Synonyms:
CHEMBL3623375
Type:
Small organic molecule
Emp. Form.:
C25H31N7O3S
Mol. Mass.:
509.624
SMILES:
CN(C)CCCNC(=O)c1csc2nc(cn12)-c1ccc(NC(=O)Nc2cc(on2)C(C)(C)C)cc1
: