Target
Lysosomal alpha-glucosidase
Ligand
BDBM50123929
Substrate
Meas. Tech.
ChEMBL_1519497 (CHEMBL3625683)
IC50
33890±n/a nM
Citation
 Ramadhan, RPhuwapraisirisan, P New arylalkanones from Horsfieldia macrobotrys, effective antidiabetic agents concomitantly inhibitinga-glucosidase and free radicals. Bioorg Med Chem Lett 25:4529-33 (2015)  
Target
Name:
Lysosomal alpha-glucosidase
Synonyms:
Acidic alpha-glucosidase LYAG_RAT
Type:
PROTEIN
Mol. Mass.:
106191.24
Organism:
Rattus norvegicus
Description:
ChEMBL_1506157
Residue:
953
  
Inhibitor
Name:
BDBM50123929
Synonyms:
CHEMBL3621760
Type:
Small organic molecule
Emp. Form.:
C36H40O7
Mol. Mass.:
584.6986
SMILES:
O[C@@H](CCCCCCCC(=O)c1c(O)cc(O)c(C(CCc2ccccc2)c2ccc(O)cc2O)c1O)c1ccccc1
: