Target
Tyrosine-protein kinase JAK2
Ligand
BDBM50109821
Substrate
Meas. Tech.
ChEMBL_1520196 (CHEMBL3625905)
IC50
1400±n/a nM
Citation
 Kim, MKShin, HPark, KSKim, HPark, JKim, KNam, JChoo, HChong, Y Benzimidazole Derivatives as Potent JAK1-Selective Inhibitors. J Med Chem 58:7596-602 (2015)  
Target
Name:
Tyrosine-protein kinase JAK2
Synonyms:
JAK-2 JAK2_HUMAN Janus kinase 2 (JAK2) | Janus kinase 2 (a protein tyrosine kinase)
Type:
Protein
Mol. Mass.:
130684.68
Organism:
Homo sapiens (Human)
Description:
O60674
Residue:
1132
  
Inhibitor
Name:
BDBM50109821
Synonyms:
CHEBI:87103 US10981896, Compound 420099
Type:
Small organic molecule
Emp. Form.:
C18H16FN3O
Mol. Mass.:
309.3375
SMILES:
CC(C)(C)c1nc2c([nH]1)c1cc[nH]c(=O)c1c1cc(F)ccc21
: