Target
Non-receptor tyrosine-protein kinase TYK2
Ligand
BDBM50124208
Substrate
Meas. Tech.
ChEMBL_1520183 (CHEMBL3625892)
IC50
4.8±n/a nM
Citation
 Kim, MKShin, HPark, KSKim, HPark, JKim, KNam, JChoo, HChong, Y Benzimidazole Derivatives as Potent JAK1-Selective Inhibitors. J Med Chem 58:7596-602 (2015)  
Target
Name:
Non-receptor tyrosine-protein kinase TYK2
Synonyms:
Non-receptor tyrosine-protein kinase TYK2 (TYK2) TYK2_HUMAN | Tyrosine-protein kinase TYK2
Type:
Protein
Mol. Mass.:
133666.03
Organism:
Homo sapiens (Human)
Description:
P29597
Residue:
1187
  
Inhibitor
Name:
BDBM50124208
Synonyms:
ASP-015K Peficitinib
Type:
Small organic molecule
Emp. Form.:
C18H22N4O2
Mol. Mass.:
326.3929
SMILES:
NC(=O)c1cnc2[nH]ccc2c1N[C@H]1[C@H]2CC3C[C@@H]1C[C@](O)(C3)C2
: