Target
Tyrosine-protein kinase JAK1
Ligand
BDBM50021656
Substrate
Meas. Tech.
ChEMBL_1520180 (CHEMBL3625889)
IC50
6.0±n/a nM
Citation
 Kim, MKShin, HPark, KSKim, HPark, JKim, KNam, JChoo, HChong, Y Benzimidazole Derivatives as Potent JAK1-Selective Inhibitors. J Med Chem 58:7596-602 (2015)  
Target
Name:
Tyrosine-protein kinase JAK1
Synonyms:
JAK-1 JAK1A JAK1_HUMAN Janus kinase 1 (JAK1) | Janus kinase 1 JAK1
Type:
Protein
Mol. Mass.:
133293.73
Organism:
Homo sapiens (Human)
Description:
P23458
Residue:
1154
  
Inhibitor
Name:
BDBM50021656
Synonyms:
BARICITINIB LY-3009104 US10766894, Compound TABLE 1.19 US11203595, TABLE 1.19 US20230416237, Example baricitinib
Type:
Small organic molecule
Emp. Form.:
C16H17N7O2S
Mol. Mass.:
371.417
SMILES:
CCS(=O)(=O)N1CC(CC#N)(C1)n1cc(cn1)-c1ncnc2[nH]ccc12
: