Target
Beta-galactosidase
Ligand
BDBM50124579
Substrate
Meas. Tech.
ChEMBL_1520869 (CHEMBL3626254)
IC50
800±n/a nM
Citation
 Pawar, NJParihar, VSKhan, AJoshi, RDhavale, DD Quaternary Indolizidine and Indolizidone Iminosugars as Potential Immunostimulating and Glycosidase Inhibitory Agents: Synthesis, Conformational Analysis, Biological Activity, and Molecular Docking Study. J Med Chem 58:7820-32 (2015)  
Target
Name:
Beta-galactosidase
Synonyms:
β-galactosidase Beta-galactosidase/Glucosylceramidase | GLB1
Type:
Protein
Mol. Mass.:
73420.88
Organism:
Bos taurus (Bovine)
Description:
Residue:
653
  
Inhibitor
Name:
BDBM50124579
Synonyms:
CHEMBL3621532
Type:
Small organic molecule
Emp. Form.:
C9H15NO5
Mol. Mass.:
217.2191
SMILES:
OC[C@]12CCC(=O)N1C[C@H](O)[C@@H](O)[C@@H]2O
: