Target
cAMP and cAMP-inhibited cGMP 3',5'-cyclic phosphodiesterase 10A
Ligand
BDBM50124625
Substrate
Meas. Tech.
ChEMBL_1520899 (CHEMBL3626399)
Ki
890±n/a nM
Citation
 Shipe, WDSharik, SSBarrow, JCMcGaughey, GBTheberge, CRUslaner, JMYan, YRenger, JJSmith, SMColeman, PJCox, CD Discovery and Optimization of a Series of Pyrimidine-Based Phosphodiesterase 10A (PDE10A) Inhibitors through Fragment Screening, Structure-Based Design, and Parallel Synthesis. J Med Chem 58:7888-94 (2015)  
Target
Name:
cAMP and cAMP-inhibited cGMP 3',5'-cyclic phosphodiesterase 10A
Synonyms:
3',5'-cyclic phosphodiesterase PDE10_HUMAN Phosphodiesterase 10A
Type:
Protein
Mol. Mass.:
88412.52
Organism:
Homo sapiens (Human)
Description:
Q9Y233
Residue:
779
  
Inhibitor
Name:
BDBM50124625
Synonyms:
CHEMBL3621555
Type:
Small organic molecule
Emp. Form.:
C15H17ClN4
Mol. Mass.:
288.775
SMILES:
CC(Nc1nc(nc(Cl)c1C)C1CC1)c1ccncc1
: