Target
Tyrosine-protein kinase SYK
Ligand
BDBM50124712
Substrate
Meas. Tech.
ChEMBL_1521326 (CHEMBL3627015)
Temperature
298.15±n/a K
IC50
72±n/a nM
Comments
extracted
Citation
 Choi, JSHwang, HJKim, SWLee, BILee, JSong, HJKoh, JSKim, JHLee, PH Highly potent and selective pyrazolylpyrimidines as Syk kinase inhibitors. Bioorg Med Chem Lett 25:4441-6 (2015)  
Target
Name:
Tyrosine-protein kinase SYK
Synonyms:
KSYK_HUMAN Spleen Tyrosine Kinase Tyrosine-protein kinase SYK (Syk)
Type:
Enzyme
Mol. Mass.:
72079.99
Organism:
Homo sapiens (Human)
Description:
P43405
Residue:
635
  
Inhibitor
Name:
BDBM50124712
Synonyms:
CHEMBL3622931
Type:
Small organic molecule
Emp. Form.:
C21H27N5O3
Mol. Mass.:
397.4708
SMILES:
COc1cc(Nc2nccc(n2)-n2cc(C)c(CN(C)C)c2)cc(OC)c1OC
: