Target
Acetylcholinesterase
Ligand
BDBM50281126
Substrate
Meas. Tech.
ChEMBL_1521647 (CHEMBL3626447)
IC50
5.0±n/a nM
Citation
 Camerino, EWong, DMTong, FKörber, FGross, ADIslam, RViayna, EMutunga, JMLi, JTotrov, MMBloomquist, JRCarlier, PR Difluoromethyl ketones: Potent inhibitors of wild type and carbamate-insensitive G119S mutant Anopheles gambiae acetylcholinesterase. Bioorg Med Chem Lett 25:4405-11 (2015)  
Target
Name:
Acetylcholinesterase
Synonyms:
ACES_HUMAN Acetylcholinesterase (AChE) | Acetylcholinesterase (human AChE)
Type:
Enzyme
Mol. Mass.:
67792.70
Organism:
Homo sapiens (Human)
Description:
P22303
Residue:
614
  
Inhibitor
Name:
BDBM50281126
Synonyms:
1-(3-tert-Butyl-phenyl)-2,2,2-trifluoro-ethanone | CHEMBL89354
Type:
Small organic molecule
Emp. Form.:
C12H13F3O
Mol. Mass.:
230.2262
SMILES:
CC(C)(C)c1cccc(c1)C(=O)C(F)(F)F
: