Target
Acetylcholinesterase
Ligand
BDBM50124888
Substrate
Meas. Tech.
ChEMBL_1521648 (CHEMBL3626448)
IC50
3950±n/a nM
Citation
 Camerino, EWong, DMTong, FKörber, FGross, ADIslam, RViayna, EMutunga, JMLi, JTotrov, MMBloomquist, JRCarlier, PR Difluoromethyl ketones: Potent inhibitors of wild type and carbamate-insensitive G119S mutant Anopheles gambiae acetylcholinesterase. Bioorg Med Chem Lett 25:4405-11 (2015)  
Target
Name:
Acetylcholinesterase
Synonyms:
ACE1 ACES_ANOGA AChE Acetylcholinesterase
Type:
PROTEIN
Mol. Mass.:
80902.47
Organism:
Anopheles gambiae
Description:
ChEMBL_104567
Residue:
737
  
Inhibitor
Name:
BDBM50124888
Synonyms:
CHEMBL3623560
Type:
Small organic molecule
Emp. Form.:
C9H12F2N2O
Mol. Mass.:
202.2012
SMILES:
CC(C)Cn1cc(cn1)C(=O)C(F)F
: