Target
Acetylcholinesterase
Ligand
BDBM50124886
Substrate
Meas. Tech.
ChEMBL_1521648 (CHEMBL3626448)
IC50
>10000±n/a nM
Citation
 Camerino, EWong, DMTong, FKörber, FGross, ADIslam, RViayna, EMutunga, JMLi, JTotrov, MMBloomquist, JRCarlier, PR Difluoromethyl ketones: Potent inhibitors of wild type and carbamate-insensitive G119S mutant Anopheles gambiae acetylcholinesterase. Bioorg Med Chem Lett 25:4405-11 (2015)  
Target
Name:
Acetylcholinesterase
Synonyms:
ACE1 ACES_ANOGA AChE Acetylcholinesterase
Type:
PROTEIN
Mol. Mass.:
80902.47
Organism:
Anopheles gambiae
Description:
ChEMBL_104567
Residue:
737
  
Inhibitor
Name:
BDBM50124886
Synonyms:
CHEMBL3623562
Type:
Small organic molecule
Emp. Form.:
C8H11FN2O
Mol. Mass.:
170.1841
SMILES:
CC(C)n1cc(cn1)C(=O)CF
: