Target
Acetylcholinesterase
Ligand
BDBM50064617
Substrate
Meas. Tech.
ChEMBL_1521650 (CHEMBL3626450)
IC50
182±n/a nM
Citation
 Camerino, EWong, DMTong, FKörber, FGross, ADIslam, RViayna, EMutunga, JMLi, JTotrov, MMBloomquist, JRCarlier, PR Difluoromethyl ketones: Potent inhibitors of wild type and carbamate-insensitive G119S mutant Anopheles gambiae acetylcholinesterase. Bioorg Med Chem Lett 25:4405-11 (2015)  
Target
Name:
Acetylcholinesterase
Synonyms:
ACE1 ACES_ANOGA AChE Acetylcholinesterase
Type:
PROTEIN
Mol. Mass.:
80902.47
Organism:
Anopheles gambiae
Description:
ChEMBL_104567
Residue:
737
  
Inhibitor
Name:
BDBM50064617
Synonyms:
CHEBI:34938 | Propoxur
Type:
Small organic molecule
Emp. Form.:
C11H15NO3
Mol. Mass.:
209.2417
SMILES:
CNC(=O)Oc1ccccc1OC(C)C
: