Target
Androgen receptor
Ligand
BDBM50125052
Substrate
Meas. Tech.
ChEMBL_1519272 (CHEMBL3624769)
IC50
30000±n/a nM
Citation
 De Savi, CBradbury, RHRabow, AANorman, RAde Almeida, CAndrews, DMBallard, PButtar, DCallis, RJCurrie, GSCurwen, JODavies, CDDonald, CSFeron, LJGingell, HGlossop, SCHayter, BRHussain, SKaroutchi, GLamont, SGMacFaul, PMoss, TAPearson, SETonge, MWalker, GEWeir, HMWilson, Z Optimization of a Novel Binding Motif to (E)-3-(3,5-Difluoro-4-((1R,3R)-2-(2-fluoro-2-methylpropyl)-3-methyl-2,3,4,9-tetrahydro-1H-pyrido[3,4-b]indol-1-yl)phenyl)acrylic Acid (AZD9496), a Potent and Orally Bioavailable Selective Estrogen Receptor Downregulator and Antagonist. J Med Chem 58:8128-40 (2015)  
Target
Name:
Androgen receptor
Synonyms:
ANDR_HUMAN Androgen Receptor Androgen receptor/Baculoviral IAP repeat-containing protein 2 Dihydrotestosterone receptor Nuclear receptor subfamily 3 group C member 4
Type:
Receptor
Mol. Mass.:
99185.27
Organism:
Homo sapiens (Human)
Description:
CHO cells were stably transfected with human AR gene.
Residue:
920
  
Inhibitor
Name:
BDBM50125052
Synonyms:
CHEMBL3623004 WO-2014/191726, Example 1
Type:
Small organic molecule
Emp. Form.:
C25H25F3N2O2
Mol. Mass.:
442.4734
SMILES:
C[C@@H]1Cc2c([nH]c3ccccc23)[C@H](N1CC(C)(C)F)c1c(F)cc(\C=C\C(O)=O)cc1F
: