Target
Peptidyl-prolyl cis-trans isomerase FKBP5
Ligand
BDBM50125257
Substrate
Meas. Tech.
ChEMBL_1519315 (CHEMBL3624906)
Ki
700±n/a nM
Citation
 Feng, XSippel, CBracher, AHausch, F Structure-Affinity Relationship Analysis of Selective FKBP51 Ligands. J Med Chem 58:7796-806 (2015)  
Target
Name:
Peptidyl-prolyl cis-trans isomerase FKBP5
Synonyms:
51 kDa FK506-binding protein 54 kDa progesterone receptor-associated immunophilin Androgen-regulated protein 6 FK506-binding protein 5 FKBP-51 FKBP51 FKBP5_HUMAN PPIase FKBP5 p54
Type:
PROTEIN
Mol. Mass.:
51207.06
Organism:
Homo sapiens (Human)
Description:
ChEMBL_952910
Residue:
457
  
Inhibitor
Name:
BDBM50125257
Synonyms:
CHEMBL3623623
Type:
Small organic molecule
Emp. Form.:
C39H56N2O8
Mol. Mass.:
680.8705
SMILES:
COc1ccc(CC[C@@H](OC(=O)[C@@H]2CCCCN2C(=O)[C@H]([C@@H](C)O)C2CCCCC2)c2cccc(OCCN3CCOCC3)c2)cc1OC
: