Target
Peptidyl-prolyl cis-trans isomerase FKBP5
Ligand
BDBM50125261
Substrate
Meas. Tech.
ChEMBL_1519315 (CHEMBL3624906)
Ki
2000±n/a nM
Citation
 Feng, XSippel, CBracher, AHausch, F Structure-Affinity Relationship Analysis of Selective FKBP51 Ligands. J Med Chem 58:7796-806 (2015)  
Target
Name:
Peptidyl-prolyl cis-trans isomerase FKBP5
Synonyms:
51 kDa FK506-binding protein 54 kDa progesterone receptor-associated immunophilin Androgen-regulated protein 6 FK506-binding protein 5 FKBP-51 FKBP51 FKBP5_HUMAN PPIase FKBP5 p54
Type:
PROTEIN
Mol. Mass.:
51207.06
Organism:
Homo sapiens (Human)
Description:
ChEMBL_952910
Residue:
457
  
Inhibitor
Name:
BDBM50125261
Synonyms:
CHEMBL3623622
Type:
Small organic molecule
Emp. Form.:
C41H60N2O9
Mol. Mass.:
724.9231
SMILES:
COCO[C@H](C)[C@H](C1CCCCC1)C(=O)N1CCCC[C@H]1C(=O)O[C@H](CCc1ccc(OC)c(OC)c1)c1cccc(OCCN2CCOCC2)c1
: