Target
3-phosphoinositide-dependent protein kinase 1
Ligand
BDBM50125791
Substrate
Meas. Tech.
ChEMBL_1519597 (CHEMBL3626033)
EC50
40000±n/a nM
Citation
 Rettenmaier, TJFan, HKarpiak, JDoak, ASali, AShoichet, BKWells, JA Small-Molecule Allosteric Modulators of the Protein Kinase PDK1 from Structure-Based Docking. J Med Chem 58:8285-91 (2015)  
Target
Name:
3-phosphoinositide-dependent protein kinase 1
Synonyms:
3-Phosphoinositide-Dependent Protein Kinase 1 (PDK1) 3-phosphoinositide-dependent protein kinase 1 3-phosphoinositide-dependent protein kinase 1 (PDK-1) Isoform 2 of 3-phosphoinositide-dependent protein kinase 1 PDPK1 Phosphoinositide-dependent protein kinase 1 (PDK1) hPDK1
Type:
Enzyme
Mol. Mass.:
63157.65
Organism:
Homo sapiens (Human)
Description:
O15530
Residue:
556
  
Inhibitor
Name:
BDBM50125791
Synonyms:
CHEMBL3623844
Type:
Small organic molecule
Emp. Form.:
C19H20N2O3S
Mol. Mass.:
356.439
SMILES:
Cc1ccc(OCCSc2nc3ccccc3n2CC(O)=O)c(C)c1
: