Target
Coagulation factor IX
Ligand
BDBM50125965
Substrate
Meas. Tech.
ChEMBL_1522950 (CHEMBL3630982)
Ki
8±n/a nM
Citation
 Zhang, TAndre, PBateman, TJChen, YHDesai, KEllsworth, KGeissler, WMGuo, LHruza, AJian, TMeng, DParker, DLQian, XReichert, PSherer, ECShu, MSmith, CJSonatore, LMTschirret-Guth, RNolting, AFOrr, RCampeau, LCAraki, KNishimura, TSakurada, IWood, HB Development of a novel class of potent and selective FIXa inhibitors. Bioorg Med Chem Lett 25:4945-9 (2015)  
Target
Name:
Coagulation factor IX
Synonyms:
Christmas factor Coagulation factor IX/VIII Coagulation factor IXa heavy chain F9 Factor IX Factor IXa (fIXa) Plasma thromboplastin component
Type:
Enzyme
Mol. Mass.:
51768.83
Organism:
Homo sapiens (Human)
Description:
P00740
Residue:
461
  
Inhibitor
Name:
BDBM50125965
Synonyms:
CHEMBL3627866
Type:
Small organic molecule
Emp. Form.:
C27H25ClN6O
Mol. Mass.:
484.98
SMILES:
Cc1cc2nc([nH]c2cc1C)[C@@H](CNC(=O)c1c(C)cc(cc1Cl)-n1cnnc1)c1ccccc1
: