Target
Indoleamine 2,3-dioxygenase 1
Ligand
BDBM36371
Substrate
Meas. Tech.
ChEMBL_1523460 (CHEMBL3630804)
Ki
11400±n/a nM
Citation
 Dounay, ABTuttle, JBVerhoest, PR Challenges and Opportunities in the Discovery of New Therapeutics Targeting the Kynurenine Pathway. J Med Chem 58:8762-82 (2015)  
Target
Name:
Indoleamine 2,3-dioxygenase 1
Synonyms:
I23O1_HUMAN IDO-1 INDO Indoleamine 2,3-dioxygenase | Indoleamine-pyrrole 2,3-dioxygenase
Type:
Enzyme
Mol. Mass.:
45330.80
Organism:
Homo sapiens (Human)
Description:
P14902
Residue:
403
  
Inhibitor
Name:
BDBM36371
Synonyms:
5-(1H-indol-3-ylmethyl)-3-methyl-2-thioxo-4-Imidazolidinone, Nec-1 US10501473, Comparative Example 1
Type:
Small organic molecule
Emp. Form.:
C13H13N3OS
Mol. Mass.:
259.327
SMILES:
CN1C(=S)NC(Cc2c[nH]c3ccccc23)C1=O
: