Target
Protein mono-ADP-ribosyltransferase PARP10
Ligand
BDBM50126165
Substrate
Meas. Tech.
ChEMBL_1523605 (CHEMBL3631404)
IC50
8511±n/a nM
Citation
 Morgan, RKCarter-O'Connell, ICohen, MS Selective inhibition of PARP10 using a chemical genetics strategy. Bioorg Med Chem Lett 25:4770-3 (2015)  
Target
Name:
Protein mono-ADP-ribosyltransferase PARP10
Synonyms:
2.4.2.- ADP-ribosyltransferase diphtheria toxin-like 10 Human diphtheria toxin-like ADP-ribosyltransferase (ARTD10 or PARP10, L926Y)) Human diphtheria toxin-like ADP-ribosyltransferase (ARTD10 or PARP10, S927A)) PARP-10 Poly [ADP-ribose] polymerase 10
Type:
Mol. Mass.:
109953.63
Organism:
Homo sapiens (Human)
Description:
Q53GL7
Residue:
1025
  
Inhibitor
Name:
BDBM50126165
Synonyms:
CHEMBL3629673
Type:
Small organic molecule
Emp. Form.:
C9H8BrNO
Mol. Mass.:
226.07
SMILES:
Brc1ccc2CCNC(=O)c2c1
: