Target
Aminopeptidase N
Ligand
BDBM50024102
Substrate
Meas. Tech.
ChEMBL_1523621 (CHEMBL3631552)
Ki
>10000±n/a nM
Citation
 Poras, HBonnard, EFournié-Zaluski, MCRoques, BP Modulation of disulfide dual ENKephalinase inhibitors (DENKIs) activity by a transient N-protection for pain alleviation by oral route. Eur J Med Chem 102:58-67 (2015)  
Target
Name:
Aminopeptidase N
Synonyms:
AMPN_HUMAN APN Aminopeptidase CD_antigen=CD13 Myeloid plasma membrane glycoprotein CD13 gp150 | hAPN
Type:
PROTEIN
Mol. Mass.:
109522.63
Organism:
Homo sapiens (Human)
Description:
ChEMBL_1507526
Residue:
967
  
Inhibitor
Name:
BDBM50024102
Synonyms:
((S)-2-Mercaptomethyl-3-phenyl-propionylamino)-acetic acid (S) (2-Mercaptomethyl-3-phenyl-propionylamino)-acetic acid CHEMBL298827
Type:
Small organic molecule
Emp. Form.:
C12H15NO3S
Mol. Mass.:
253.317
SMILES:
OC(=O)CNC(=O)[C@@H](CS)Cc1ccccc1
: