Target
Trifunctional purine biosynthetic protein adenosine-3
Ligand
BDBM50126172
Substrate
Meas. Tech.
ChEMBL_1523833 (CHEMBL3632394)
Ki
13±n/a nM
Citation
 Wang, LWallace, ARaghavan, SDeis, SMWilson, MRYang, SPolin, LWhite, KKushner, JOrr, SGeorge, CO'Connor, CHou, ZMitchell-Ryan, SDann, CEMatherly, LHGangjee, A 6-Substituted Pyrrolo[2,3-d]pyrimidine Thienoyl Regioisomers as Targeted Antifolates for Folate Receptora and the Proton-Coupled Folate Transporter in Human Tumors. J Med Chem 58:6938-59 (2015)  
Target
Name:
Trifunctional purine biosynthetic protein adenosine-3
Synonyms:
GAR Tfase GART Glycinamide ribonucleotide transformylase (GAR Tfase) PRGS Thymidylate synthase/GAR transformylase/AICAR transformylase
Type:
Protein
Mol. Mass.:
107768.47
Organism:
Homo sapiens (Human)
Description:
P22102
Residue:
1010
  
Inhibitor
Name:
BDBM50126172
Synonyms:
CHEMBL3628344
Type:
Small organic molecule
Emp. Form.:
C19H21N5O6S
Mol. Mass.:
447.465
SMILES:
Nc1nc2[nH]c(CCCc3csc(c3)C(=O)N[C@@H](CCC(O)=O)C(O)=O)cc2c(=O)[nH]1
: