Target
Coagulation factor IX
Ligand
BDBM50126928
Substrate
Meas. Tech.
ChEMBL_1524004 (CHEMBL3630476)
Ki
13±n/a nM
Citation
 Meng, DAndre, PBateman, TJBerger, RChen, YHDesai, KDewnani, SEllsworth, KFeng, DGeissler, WMGuo, LHruza, AJian, TLi, HMetzger, JParker, DLReichert, PSherer, ECSmith, CJSonatore, LMTschirret-Guth, RWu, JXu, JZhang, TCampeau, LCOrr, RPoirier, MMcCabe-Dunn, JAraki, KNishimura, TSakurada, IHirabayashi, TWood, HB Development of a novel tricyclic class of potent and selective FIXa inhibitors. Bioorg Med Chem Lett 25:5437-43 (2015)  
Target
Name:
Coagulation factor IX
Synonyms:
Christmas factor Coagulation factor IX/VIII Coagulation factor IXa heavy chain F9 Factor IX Factor IXa (fIXa) Plasma thromboplastin component
Type:
Enzyme
Mol. Mass.:
51768.83
Organism:
Homo sapiens (Human)
Description:
P00740
Residue:
461
  
Inhibitor
Name:
BDBM50126928
Synonyms:
CHEMBL3628837
Type:
Small organic molecule
Emp. Form.:
C24H24Cl2N6O2
Mol. Mass.:
499.392
SMILES:
CC(O)[C@]1(CCc2nn3cc(C)ccc3c2C1)NC(=O)c1c(Cl)cc(cc1Cl)-n1cnc(C)n1
: