Target
Coagulation factor IX
Ligand
BDBM50126950
Substrate
Meas. Tech.
ChEMBL_1524004 (CHEMBL3630476)
Ki
11±n/a nM
Citation
 Meng, DAndre, PBateman, TJBerger, RChen, YHDesai, KDewnani, SEllsworth, KFeng, DGeissler, WMGuo, LHruza, AJian, TLi, HMetzger, JParker, DLReichert, PSherer, ECSmith, CJSonatore, LMTschirret-Guth, RWu, JXu, JZhang, TCampeau, LCOrr, RPoirier, MMcCabe-Dunn, JAraki, KNishimura, TSakurada, IHirabayashi, TWood, HB Development of a novel tricyclic class of potent and selective FIXa inhibitors. Bioorg Med Chem Lett 25:5437-43 (2015)  
Target
Name:
Coagulation factor IX
Synonyms:
Christmas factor Coagulation factor IX/VIII Coagulation factor IXa heavy chain F9 Factor IX Factor IXa (fIXa) Plasma thromboplastin component
Type:
Enzyme
Mol. Mass.:
51768.83
Organism:
Homo sapiens (Human)
Description:
P00740
Residue:
461
  
Inhibitor
Name:
BDBM50126950
Synonyms:
CHEMBL3628955
Type:
Small organic molecule
Emp. Form.:
C28H24ClN5O3
Mol. Mass.:
513.975
SMILES:
Cc1ccc2c3C[C@@](C)(CCc3nn2c1)NC(=O)c1ccc(cc1Cl)-n1cnc2cc(ccc12)C(O)=O
: