Target
Lactoylglutathione lyase
Ligand
BDBM50126959
Substrate
Meas. Tech.
ChEMBL_1524150 (CHEMBL3631235)
Ki
330±n/a nM
Citation
 Sang, YShi, QMo, MNi, CLi, ZLiu, BDeng, QCreighton, DJZheng, ZB Novel bivalent inhibitors with sub-nanomolar affinities towards human glyoxalase I. Bioorg Med Chem Lett 25:4724-7 (2015)  
Target
Name:
Lactoylglutathione lyase
Synonyms:
Aldoketomutase Glx I Glyoxalase I LGUL_HUMAN S-D-lactoylglutathione methylglyoxal lyase
Type:
Enzyme
Mol. Mass.:
20772.95
Organism:
Homo sapiens (Human)
Description:
Q04760
Residue:
184
  
Inhibitor
Name:
BDBM50126959
Synonyms:
CHEMBL3629117
Type:
Small organic molecule
Emp. Form.:
C20H26ClN5O9S
Mol. Mass.:
547.967
SMILES:
NCCC(=O)NC(CCC(=O)NC(CSC(=O)N(O)c1ccc(Cl)cc1)C(=O)NCC(O)=O)C(O)=O
: