Target
Tryptophan 2,3-dioxygenase
Ligand
BDBM50127164
Substrate
Meas. Tech.
ChEMBL_1524691 (CHEMBL3631085)
IC50
59±n/a nM
Citation
 Wu, JSLin, SYLiao, FYHsiao, WCLee, LCPeng, YHHsieh, CLWu, MHSong, JSYueh, AChen, CHYeh, SHLiu, CYLin, SYYeh, TKHsu, JTShih, CUeng, SHHung, MSWu, SY Identification of Substituted Naphthotriazolediones as Novel Tryptophan 2,3-Dioxygenase (TDO) Inhibitors through Structure-Based Virtual Screening. J Med Chem 58:7807-19 (2015)  
Target
Name:
Tryptophan 2,3-dioxygenase
Synonyms:
T23O_HUMAN TDO2 TRPO Tryptophan oxygenase Tryptophanase
Type:
PROTEIN
Mol. Mass.:
47874.48
Organism:
Homo sapiens (Human)
Description:
ChEMBL_825691
Residue:
406
  
Inhibitor
Name:
BDBM50127164
Synonyms:
CHEMBL3628597
Type:
Small organic molecule
Emp. Form.:
C24H21N5O4
Mol. Mass.:
443.4546
SMILES:
CC(=O)N1CCN(CC1)C(=O)c1cccc(Cn2nnc3c2C(=O)c2ccccc2C3=O)c1
: