Target
Indoleamine 2,3-dioxygenase 1
Ligand
BDBM50127135
Substrate
Meas. Tech.
ChEMBL_1524692 (CHEMBL3631086)
IC50
767±n/a nM
Citation
 Wu, JSLin, SYLiao, FYHsiao, WCLee, LCPeng, YHHsieh, CLWu, MHSong, JSYueh, AChen, CHYeh, SHLiu, CYLin, SYYeh, TKHsu, JTShih, CUeng, SHHung, MSWu, SY Identification of Substituted Naphthotriazolediones as Novel Tryptophan 2,3-Dioxygenase (TDO) Inhibitors through Structure-Based Virtual Screening. J Med Chem 58:7807-19 (2015)  
Target
Name:
Indoleamine 2,3-dioxygenase 1
Synonyms:
I23O1_HUMAN IDO-1 INDO Indoleamine 2,3-dioxygenase | Indoleamine-pyrrole 2,3-dioxygenase
Type:
Enzyme
Mol. Mass.:
45330.80
Organism:
Homo sapiens (Human)
Description:
P14902
Residue:
403
  
Inhibitor
Name:
BDBM50127135
Synonyms:
CHEMBL3628551
Type:
Small organic molecule
Emp. Form.:
C17H10ClN3O2
Mol. Mass.:
323.733
SMILES:
Clc1cccc(Cn2nnc3c2C(=O)c2ccccc2C3=O)c1
: