Target
Cytochrome P450 3A4
Ligand
BDBM31768
Substrate
Meas. Tech.
ChEMBL_1522378 (CHEMBL3631115)
IC50
140±n/a nM
Citation
 Kaminska, KZiemba, JNer, JSchwed, JSLazewska, DWiecek, MKarcz, TOlejarz, ALatacz, GKuder, KKottke, TZygmunt, MSapa, JKarolak-Wojciechowska, JStark, HKiec-Kononowicz, K (2-Arylethenyl)-1,3,5-triazin-2-amines as a novel histamine H4 receptor ligands. Eur J Med Chem 103:238-51 (2015)  
Target
Name:
Cytochrome P450 3A4
Synonyms:
Albendazole monooxygenase CP3A4_HUMAN CYP3A4 CYPIIIA4 Cytochrome P450 3A4 (CYP3A4) Nifedipine oxidase Taurochenodeoxycholate 6-alpha-hydroxylase
Type:
Enzyme
Mol. Mass.:
57349.57
Organism:
Homo sapiens (Human)
Description:
Residue:
503
  
Inhibitor
Name:
BDBM31768
Synonyms:
CHEMBL295698 Nizoral | Panfungol
Type:
Small organic molecule
Emp. Form.:
C26H28Cl2N4O4
Mol. Mass.:
531.431
SMILES:
CC(=O)N1CCN(CC1)c1ccc(OC[C@@H]2CO[C@](Cn3ccnc3)(O2)c2ccc(Cl)cc2Cl)cc1
: