Target
Apoptosis regulator Bcl-2
Ligand
BDBM50067354
Substrate
Meas. Tech.
ChEMBL_1522987 (CHEMBL3631163)
Ki
500±n/a nM
Citation
 Fu, HHou, XWang, LDun, YYang, XFang, H Design, synthesis and biological evaluation of 3-aryl-rhodanine benzoic acids as anti-apoptotic protein Bcl-2 inhibitors. Bioorg Med Chem Lett 25:5265-9 (2015)  
Target
Name:
Apoptosis regulator Bcl-2
Synonyms:
Apoptosis regulator Bcl-2 Protein BCL-2 BCL2_HUMAN | Bcl-2 Protein
Type:
Homodimer or heterodimer
Mol. Mass.:
26269.11
Organism:
Homo sapiens (Human)
Description:
P10415
Residue:
239
  
Inhibitor
Name:
BDBM50067354
Synonyms:
CHEMBL3401826
Type:
Small organic molecule
Emp. Form.:
C32H26N2O4S3
Mol. Mass.:
598.755
SMILES:
Cc1ccc(cc1)S(=O)(=O)NC(=O)[C@H](Cc1ccccc1)N1C(=S)S\C(=C/c2ccc(cc2)-c2ccccc2)C1=O
: