Target
Muscarinic acetylcholine receptor M3
Ligand
BDBM50128834
Substrate
Meas. Tech.
ChEMBL_1522863 (CHEMBL3630581)
Ki
3.7±n/a nM
Citation
 Jones, LHBurrows, JFeeder, NGlossop, PJames, KJones, RMKenyon, ASPatel, SRoberts, DFSelby, MDStrang, RSStuart, EFTrevethick, MAWatson, JWright, KNClarke, N Molecular hybridization yields triazole bronchodilators for the treatment of COPD. Bioorg Med Chem Lett 25:5121-6 (2015)  
Target
Name:
Muscarinic acetylcholine receptor M3
Synonyms:
ACM3_HUMAN Cholinergic, muscarinic M3 Muscarinic receptor M3 | RecName: Full=Muscarinic acetylcholine receptor M3
Type:
Enzyme
Mol. Mass.:
66151.03
Organism:
Homo sapiens (Human)
Description:
P20309
Residue:
590
  
Inhibitor
Name:
BDBM50128834
Synonyms:
CHEMBL3629359
Type:
Small organic molecule
Emp. Form.:
C41H58N6O4
Mol. Mass.:
698.937
SMILES:
O[C@@H](CNCCCCCCCCCN1CCC(Cn2cnc(n2)[C@@](O)(C2CCCCC2)c2ccccc2)CC1)c1ccc(O)c2[nH]c(=O)ccc12
: