Target
Prothrombin
Ligand
BDBM50130216
Substrate
Meas. Tech.
ChEMBL_1525156 (CHEMBL3635494)
Ki
5.0±n/a nM
Citation
 Gillis, EPEastman, KJHill, MDDonnelly, DJMeanwell, NA Applications of Fluorine in Medicinal Chemistry. J Med Chem 58:8315-59 (2015)  
Target
Name:
Prothrombin
Synonyms:
Activation peptide fragment 1 Coagulation factor II Prothrombin precursor Thrombin heavy chain | Thrombin light chain
Type:
Protein
Mol. Mass.:
70029.57
Organism:
Homo sapiens (Human)
Description:
P00734
Residue:
622
  
Inhibitor
Name:
BDBM50130216
Synonyms:
CHEMBL3632874
Type:
Small organic molecule
Emp. Form.:
C26H31FN4O
Mol. Mass.:
434.5489
SMILES:
[H][C@]12C3CCCN3[C@@H](c3ccc(cc3)C(N)=N)[C@@]1([H])C(=O)N(Cc1ccc(F)cc1)[C@@H]2C(C)C
: