Target
Sodium channel protein type 9 subunit alpha
Ligand
BDBM50130523
Substrate
Meas. Tech.
ChEMBL_1525514 (CHEMBL3636867)
IC50
1000±n/a nM
Citation
 Suzuki, SKuroda, TKimoto, HDomon, YKubota, KKitano, YYokoyama, TShimizugawa, ASugita, RKoishi, RAsano, DTamaki, KShinozuka, TKobayashi, H Discovery of (phenoxy-2-hydroxypropyl)piperidines as a novel class of voltage-gated sodium channel 1.7 inhibitors. Bioorg Med Chem Lett 25:5419-23 (2015)  
Target
Name:
Sodium channel protein type 9 subunit alpha
Synonyms:
Kiaa4197 Peripheral sodium channel 1 Scn9a Sodium channel protein type IX subunit alpha | Voltage-gated sodium channel subunit alpha Nav1.7
Type:
PROTEIN
Mol. Mass.:
225808.99
Organism:
Mus musculus
Description:
ChEMBL_109594
Residue:
1984
  
Inhibitor
Name:
BDBM50130523
Synonyms:
CHEMBL3634331
Type:
Small organic molecule
Emp. Form.:
C28H30N2O4
Mol. Mass.:
458.5488
SMILES:
OC(COc1ccccc1C(=O)c1ccccc1)CN1CCC(CC1)C(=O)Nc1ccccc1
: