Target
Sodium channel protein type 9 subunit alpha
Ligand
BDBM50130536
Substrate
Meas. Tech.
ChEMBL_1525514 (CHEMBL3636867)
IC50
400±n/a nM
Citation
 Suzuki, SKuroda, TKimoto, HDomon, YKubota, KKitano, YYokoyama, TShimizugawa, ASugita, RKoishi, RAsano, DTamaki, KShinozuka, TKobayashi, H Discovery of (phenoxy-2-hydroxypropyl)piperidines as a novel class of voltage-gated sodium channel 1.7 inhibitors. Bioorg Med Chem Lett 25:5419-23 (2015)  
Target
Name:
Sodium channel protein type 9 subunit alpha
Synonyms:
Kiaa4197 Peripheral sodium channel 1 Scn9a Sodium channel protein type IX subunit alpha | Voltage-gated sodium channel subunit alpha Nav1.7
Type:
PROTEIN
Mol. Mass.:
225808.99
Organism:
Mus musculus
Description:
ChEMBL_109594
Residue:
1984
  
Inhibitor
Name:
BDBM50130536
Synonyms:
CHEMBL3632696
Type:
Small organic molecule
Emp. Form.:
C22H25F3N2O3
Mol. Mass.:
422.4407
SMILES:
OC(COc1ccc(cc1)C(F)(F)F)CN1CCC(CC1)NC(=O)c1ccccc1
: