Target
X-box-binding protein 1
Ligand
BDBM50131219
Substrate
Meas. Tech.
ChEBML_1526682
EC50
340±n/a nM
Citation
 Ren, JWang, YGWang, AGWu, LQZhang, HJWang, WJSu, YLQin, HL Cembranoids from the Gum Resin of Boswellia carterii as Potential Antiulcerative Colitis Agents. J Nat Prod 78:2322-31 (2015)  
Target
Name:
X-box-binding protein 1
Synonyms:
Hepatocarcinogenesis-related transcription factor X-box-binding protein 1 X-box-binding protein 1, luminal form Xbp1
Type:
PROTEIN
Mol. Mass.:
29677.58
Organism:
Rattus norvegicus
Description:
ChEMBL_109918
Residue:
267
  
Inhibitor
Name:
BDBM50131219
Synonyms:
CHEMBL3634656
Type:
Small organic molecule
Emp. Form.:
C20H34O4
Mol. Mass.:
338.4816
SMILES:
[H][C@]12CC[C@](C)(O1)[C@H](O)C[C@@]1(CC[C@@](C)(O1)[C@H](O)C\C=C2\C)C(C)C
: