Target
Serine/threonine-protein kinase pim-1
Ligand
BDBM50131225
Substrate
Meas. Tech.
ChEBML_1526828
Ki
0.015000±n/a nM
Citation
 Hu, HWang, XChan, GKChang, JHDo, SDrummond, JEbens, ALee, WLy, JLyssikatos, JPMurray, JMoffat, JGChao, QTsui, VWallweber, HKolesnikov, A Discovery of 3,5-substituted 6-azaindazoles as potent pan-Pim inhibitors. Bioorg Med Chem Lett 25:5258-64 (2015)  
Target
Name:
Serine/threonine-protein kinase pim-1
Synonyms:
PIM-1 Kinase PIM1_HUMAN Serine/threonine-protein kinase (PIM1) Serine/threonine-protein kinase PIM1 | Serine/threonine-protein kinase pim-1 (PIM1)
Type:
Protein
Mol. Mass.:
35681.82
Organism:
Homo sapiens (Human)
Description:
P11309
Residue:
313
  
Inhibitor
Name:
BDBM50131225
Synonyms:
CHEMBL3634769 | US9260425, 515
Type:
Small organic molecule
Emp. Form.:
C21H22N8O
Mol. Mass.:
402.4524
SMILES:
CCn1cncc(-c2cc3c(n[nH]c3cn2)-c2cccc(n2)N2CCNCC2)c1=O
: