Target
Translocator protein
Ligand
BDBM50131380
Substrate
Meas. Tech.
ChEBML_1526857
Ki
29±n/a nM
Citation
 Narlawar, RWerry, ELScarf, AMHanani, RChua, SWKing, VABarron, MLMartins, RNIttner, LMRendina, LMKassiou, M First Demonstration of Positive Allosteric-like Modulation at the Human Wild Type Translocator Protein (TSPO). J Med Chem 58:8743-9 (2015)  
Target
Name:
Translocator protein
Synonyms:
BZRP Mitochondrial benzodiazepine receptor PKBS Peripheral-type benzodiazepine receptor TSPO_HUMAN
Type:
Enzyme
Mol. Mass.:
18834.74
Organism:
Homo sapiens (Human)
Description:
P30536
Residue:
169
  
Inhibitor
Name:
BDBM50131380
Synonyms:
CHEMBL3634878
Type:
Small organic molecule
Emp. Form.:
C21H26N4O2
Mol. Mass.:
366.4567
SMILES:
CCN(CC)C(=O)Cn1c(nc2c(C)cc(C)nc12)-c1ccc(OC)cc1
: