Target
Carbonic anhydrase 5B, mitochondrial
Ligand
BDBM50259746
Substrate
Meas. Tech.
ChEMBL_1523554 (CHEMBL3631202)
Ki
670±n/a nM
Citation
 Maresca, AAkyuz, GOsman, SMAlOthman, ZSupuran, CT Inhibition of mammalian carbonic anhydrase isoforms I-XIV with a series of phenolic acid esters. Bioorg Med Chem 23:7181-8 (2015)  
Target
Name:
Carbonic anhydrase 5B, mitochondrial
Synonyms:
CA-VB CAH5B_HUMAN Carbonic Anhydrase VB Carbonic anhydrase 5B, mitochondrial Carbonic anhydrase V | Carbonic anhydrase VB (CA VB)
Type:
Enzyme
Mol. Mass.:
36440.83
Organism:
Homo sapiens (Human)
Description:
Human (cloned) isozyme
Residue:
317
  
Inhibitor
Name:
BDBM50259746
Synonyms:
(4-Hydroxyphenyl)ethyl trans-ferulate p-Hydroxyphenethyl trans-ferulate (18) | p-hydroxyphenethyl trans-ferulate
Type:
Small organic molecule
Emp. Form.:
C18H18O5
Mol. Mass.:
314.3325
SMILES:
COc1cc(\C=C\C(=O)OCCc2ccc(O)cc2)ccc1O
: