Target
Carbonic anhydrase 7
Ligand
BDBM50131681
Substrate
Meas. Tech.
ChEMBL_1523556 (CHEMBL3631204)
Ki
730±n/a nM
Citation
 Maresca, AAkyuz, GOsman, SMAlOthman, ZSupuran, CT Inhibition of mammalian carbonic anhydrase isoforms I-XIV with a series of phenolic acid esters. Bioorg Med Chem 23:7181-8 (2015)  
Target
Name:
Carbonic anhydrase 7
Synonyms:
CA-VII CAH7_HUMAN Carbonic anhydrase Carbonic anhydrase VII (CA VII)
Type:
Enzyme
Mol. Mass.:
29664.11
Organism:
Homo sapiens (Human)
Description:
Human cloned isozyme.
Residue:
264
  
Inhibitor
Name:
BDBM50131681
Synonyms:
CHEMBL3628131
Type:
Small organic molecule
Emp. Form.:
C25H24O6
Mol. Mass.:
420.4545
SMILES:
Oc1ccc(CCOc2ccc(CCOC(=O)\C=C\c3ccc(O)c(O)c3)cc2)cc1
: